{"text_format":"3","workbook":"xlsx","n_sheets":4,"sheets":["F1-Manager (invulblad)","F1-Manager (site)","F1-Manager (invulbladExcel)","Waardebepaling"],"not_rendered":{"defined_names":1},"read":"whole","date_system":"1900"}

{"sheet":"F1-Manager (invulblad)","index":0,"n_rows":121,"n_cols":25,"rows_kept":121,"merged":[[0,1,1,23],[2,1,2,23],[3,1,3,5],[3,11,3,17],[3,19,5,23],[4,1,4,5],[4,11,4,17],[5,1,5,5],[5,11,5,17],[6,1,6,5],[6,10,6,17],[6,19,6,23],[7,19,7,23],[9,1,9,5],[9,9,9,13],[9,17,9,21],[21,17,21,21],[22,18,22,21],[23,9,23,13],[23,18,23,21],[24,9,25,13],[24,18,24,21],[25,18,25,21],[26,18,26,21],[27,9,27,13],[27,18,27,21],[28,9,29,13],[28,18,28,21],[29,18,29,21]]}
[null,"www.haemerke.nl presents \"Formule 1 Manager 2025\""]
[]
[null,"Stuur het compleet ingevulde formulier uiterlijk 13 maart 2025 (23.59u) naar aanmelding@haemerke.nl"]
[null,"Teamnaam:",{"$nulls":8},{"$f":"SUM(D11:D30)","v":0},{"$f":"IF(K4>2,\"Je hebt TEVEEL coureurs geselecteerd!!\",(IF(K4=2,\"Je hebt je coureurs samengesteld\",(IF(K4=1, \"Je MOET nog een coureur kiezen\",(IF(K4=0,\"Kies je coureurs, minimaal en maximaal 2\")))))))","v":"Kies je coureurs, minimaal en maximaal 2"},{"$nulls":7},{"$f":"80000000-SUM(H11:H30,P11:P20,X11:X20)","v":{"v":80000000,"d":"€ 80,000,000"}}]
[{"$nulls":10},{"$f":"SUM(L11:L20)","v":0},{"$f":"IF(K5=1,\"Je hebt je chassis samengesteld\",(IF(K5>1,\"Je hebt teveel chassis geselecteerd!!\",\"Chassis aantal\")))","v":"Chassis aantal"}]
[null,"Naam Teammanager:",{"$nulls":8},{"$f":"SUM(T11:T20)","v":0},{"$f":"IF(K6=1,\"Je hebt je motor samengesteld\",(IF(K6>1,\"Je hebt teveel motoren geselecteerd!!\",\"Motor aantal\")))","v":"Motor aantal"}]
[{"$nulls":10},"Denk eraan: Van elk Formule 1 team mag u slechts één onderdeel voor uw team kiezen.",{"$nulls":8},{"$f":"IF(T4<80000,\"Je bent over het budget heen!!\",\"Budget\")","v":"Budget"}]
[{"$nulls":19},"Zie voor info www.haemerke.nl"]
[]
[null,"Coureurs",{"$nulls":7},"Chassis",{"$nulls":7},"Motor"]
[null,{"$f":"B56","v":1},{"$f":"C56","v":"Max Verstappen"},0,{"$f":"IF(OR(L11,T11,D12),\"X\",1)","v":1},{"$f":"IF(E11=1,F56,0)","v":{"v":42000000,"d":"€ 42,000,000"}},null,{"$f":"IF(D11,F11,0)","v":{"v":0,"d":"€ 0"}},null,{"$f":"J56","v":"1/30"},{"$f":"K56","v":"RED BULL _ Chassis"},0,{"$f":"IF(OR(D11,D12,T11),\"X\",1)","v":1},{"$f":"IF(M11=1,N56,0)","v":{"v":22000000,"d":"€ 22,000,000"}},null,{"$f":"IF(L11,N11,0)","v":{"v":0,"d":"€ 0"}},null,{"$f":"J72","v":"1/30"},{"$f":"K72","v":"RED BULL _ Motor"},0,{"$f":"IF(OR(D11,D12,L11),\"X\",1)","v":1},{"$f":"IF(U11=1,N72,0)","v":{"v":22000000,"d":"€ 22,000,000"}},null,{"$f":"IF(T11,V11,0)","v":{"v":0,"d":"€ 0"}}]
[null,{"$f":"B57","v":30},"Liam Lawson",0,{"$f":"IF(OR(L11,T11,D11),\"X\",1)","v":1},{"v":25000000,"d":"€ 25,000,000"},null,{"$f":"IF(D12,F12,0)","v":{"v":0,"d":"€ 0"}},null,{"$f":"J57","v":"16/44"},"FERRARI _ Chassis",0,{"$f":"IF(OR(D13,D14,T12),\"X\",1)","v":1},{"v":27000000,"d":"€ 27,000,000"},null,{"$f":"IF(L12,N12,0)","v":{"v":0,"d":"€ 0"}},null,"16/44","FERRARI _ Motor",0,{"$f":"IF(OR(D13,D14,L12),\"X\",1)","v":1},{"v":27000000,"d":"€ 27,000,000"},null,{"v":0,"d":"€ 0"}]
[null,16,"Charles Leclerc",0,{"$f":"IF(OR(L12,T12,D14),\"X\",1)","v":1},{"v":39000000,"d":"€ 39,000,000"},null,{"v":0,"d":"€ 0"},null,"4/81","MCLAREN _ Chassis",0,{"$f":"IF(OR(D15,D16,T13),\"X\",1)","v":1},{"v":28000000,"d":"€ 28,000,000"},null,{"v":0,"d":"€ 0"},null,"4/81","MCLAREN _ Motor",0,{"$f":"IF(OR(D15,D16,L13),\"X\",1)","v":1},{"v":28000000,"d":"€ 28,000,000"},null,{"v":0,"d":"€ 0"}]
[null,44,"Lewis Hamilton",0,{"$f":"IF(OR(L12,T12,D13),\"X\",1)","v":1},{"v":33000000,"d":"€ 33,000,000"},null,{"v":0,"d":"€ 0"},null,"63/12","MERCEDES _ Chassis",0,{"$f":"IF(OR(D17,D18,T14),\"X\",1)","v":1},{"v":22000000,"d":"€ 22,000,000"},null,{"v":0,"d":"€ 0"},null,"63/12","MERCEDES _ Motor",0,{"$f":"IF(OR(D17,D18,L14),\"X\",1)","v":1},{"v":22000000,"d":"€ 22,000,000"},null,{"v":0,"d":"€ 0"}]
[null,4,"Lando Norris",0,{"$f":"IF(OR(L13,T13,D16),\"X\",1)","v":1},{"v":40000000,"d":"€ 40,000,000"},null,{"v":0,"d":"€ 0"},null,"18/14","ASTON _ Chassis",0,{"$f":"IF(OR(D19,D20,T15),\"X\",1)","v":1},{"v":19000000,"d":"€ 19,000,000"},null,{"v":0,"d":"€ 0"},null,"18/14","ASTON _ Motor",0,{"$f":"IF(OR(D19,D20,L15),\"X\",1)","v":1},{"v":19000000,"d":"€ 19,000,000"},null,{"v":0,"d":"€ 0"}]
[null,81,"Oscar Piastri",0,{"$f":"IF(OR(L13,T13,D15),\"X\",1)","v":1},{"v":38000000,"d":"€ 38,000,000"},null,{"v":0,"d":"€ 0"},null,"22/6","RACINGBULLS_ Chassis",0,{"$f":"IF(OR(D21,D22,T16),\"X\",1)","v":1},{"v":15000000,"d":"€ 15,000,000"},null,{"v":0,"d":"€ 0"},null,"22/6","RACINGBULLS_ Motor",0,{"$f":"IF(OR(D21,D22,L16),\"X\",1)","v":1},{"v":15000000,"d":"€ 15,000,000"},null,{"v":0,"d":"€ 0"}]
[null,63,"George Russell",0,{"$f":"IF(OR(L14,T14,D18),\"X\",1)","v":1},{"v":33000000,"d":"€ 33,000,000"},null,{"v":0,"d":"€ 0"},null,"87/31","HAAS _ Chassis",0,{"$f":"IF(OR(D23,D24,T17),\"X\",1)","v":1},{"v":19000000,"d":"€ 19,000,000"},null,{"v":0,"d":"€ 0"},null,"87/31","HAAS _ Motor",0,{"$f":"IF(OR(D23,D24,L17),\"X\",1)","v":1},{"v":19000000,"d":"€ 19,000,000"},null,{"v":0,"d":"€ 0"}]
[null,12,"Andrea Kimi Antonelli",0,{"$f":"IF(OR(L14,T14,D17),\"X\",1)","v":1},{"v":20000000,"d":"€ 20,000,000"},null,{"v":0,"d":"€ 0"},null,"10/7","ALPINE_ Chassis",0,{"$f":"IF(OR(D25,D26,T18),\"X\",1)","v":1},{"v":15000000,"d":"€ 15,000,000"},null,{"v":0,"d":"€ 0"},null,"10/23","ALPINE_ Motor",0,{"$f":"IF(OR(D25,D26,L18),\"X\",1)","v":1},{"v":15000000,"d":"€ 15,000,000"},null,{"v":0,"d":"€ 0"}]
[null,18,"Lance Stroll",0,{"$f":"IF(OR(L15,T15,D20),\"X\",1)","v":1},{"v":14000000,"d":"€ 14,000,000"},null,{"v":0,"d":"€ 0"},null,"23/55","WILLIAMS_ Chassis",0,{"$f":"IF(OR(D27,D28,T19),\"X\",1)","v":1},{"v":9000000,"d":"€ 9,000,000"},null,{"v":0,"d":"€ 0"},null,"23/55","WILLIAMS_ Motor",0,{"$f":"IF(OR(D27,D28,L19),\"X\",1)","v":1},{"v":9000000,"d":"€ 9,000,000"},null,{"v":0,"d":"€ 0"}]
[null,14,"Fernando Alonso",0,{"$f":"IF(OR(L15,T15,D19),\"X\",1)","v":1},{"v":23000000,"d":"€ 23,000,000"},null,{"v":0,"d":"€ 0"},null,"27/5","KICK SAUBER_ Chassis",0,{"$f":"IF(OR(D29,D30,T20),\"X\",1)","v":1},{"v":8000000,"d":"€ 8,000,000"},null,{"v":0,"d":"€ 0"},null,"27/5","KICK SAUBER_ Motor",0,{"$f":"IF(OR(D29,D30,L20),\"X\",1)","v":1},{"v":8000000,"d":"€ 8,000,000"},null,{"v":0,"d":"€ 0"}]
[null,22,"Yuki Tsunoda",0,{"$f":"IF(OR(L16,T16,D22),\"X\",1)","v":1},{"v":15000000,"d":"€ 15,000,000"},null,{"v":0,"d":"€ 0"}]
[null,6,"Isack Hadjar",0,{"$f":"IF(OR(L16,T16,D21),\"X\",1)","v":1},{"v":9000000,"d":"€ 9,000,000"},null,{"v":0,"d":"€ 0"},{"$nulls":9},"Uitleg"]
[null,87,"Olivier Bearman",0,{"$f":"IF(OR(L17,T17,D24),\"X\",1)","v":1},{"v":14000000,"d":"€ 14,000,000"},null,{"v":0,"d":"€ 0"},{"$nulls":9},"1.","Vul je teamnaam en de naam van de manager in."]
[null,31,"Esteban Ocon",0,{"$f":"IF(OR(L17,T17,D23),\"X\",1)","v":1},{"v":19000000,"d":"€ 19,000,000"},null,{"v":0,"d":"€ 0"},null,"Wie wordt volgens jou Wereldkampioen?",{"$nulls":7},"2.","Bij het item Coureurs, Chassis en Motor vul je in het gele een "]
[null,10,"Pierre Gasly",0,{"$f":"IF(OR(L18,T18,D26),\"X\",1)","v":1},{"v":16000000,"d":"€ 16,000,000"},null,{"v":0,"d":"€ 0"},{"$nulls":10},"1 voor de betreffende item wat je wilt. Als je wilt corrigeren "]
[null,7,"Jack Doohan",0,{"$f":"IF(OR(L18,T18,D25),\"X\",1)","v":1},{"v":10000000,"d":"€ 10,000,000"},null,{"v":0,"d":"€ 0"},{"$nulls":10},"vul je weer een 0 in."]
[null,23,"Alex Albon",0,{"$f":"IF(OR(L19,T19,D28),\"X\",1)","v":1},{"v":11000000,"d":"€ 11,000,000"},null,{"v":0,"d":"€ 0"},{"$nulls":9},"3.","Vul jouw voorspelling van de wereldkampioen in."]
[null,{"$f":"B73","v":55},"Carlos Sainz",0,{"$f":"IF(OR(L19,T19,D27),\"X\",1)","v":1},{"v":11000000,"d":"€ 11,000,000"},null,{"v":0,"d":"€ 0"},null,"Hoeveel GP-wedstrijden wint de wereldkampioen?",{"$nulls":7},"4.","Vul jouw voorspelling van het aantal wedstrijden in dat deze "]
[null,27,"Nico Hülkenberg",0,{"$f":"IF(OR(L20,T20,D30),\"X\",1)","v":1},{"v":11000000,"d":"€ 11,000,000"},null,{"v":0,"d":"€ 0"},{"$nulls":10},"wereldkampioen zal winnen."]
[null,5,"Gabriël Bortoleto",0,{"$f":"IF(OR(L20,T20,D29),\"X\",1)","v":1},{"v":9000000,"d":"€ 9,000,000"},null,{"v":0,"d":"€ 0"},{"$nulls":9},"5.","Let op! Rood is er iets niet goed!!"]
[null,"2025 - Versie 0.2",{"$nulls":5},{"v":0,"d":"€ 0"}]
[{"$nulls":7},{"v":0,"d":"€ 0"}]
{"$rows_empty":22}
[null,null,"Coureurs",{"$nulls":7},"Chassis"]
[null,1,"Max Verstappen","MV",null,{"v":42000000,"d":"€ 42,000,000"},{"$nulls":3},{"$f":"CONCATENATE($B$56,\"/\",$B$57)","v":"1/30"},"RED BULL _ Chassis","RB",null,{"v":22000000,"d":"€ 22,000,000"},{"$nulls":4},"Max Verstappen",null,null,42000000]
[null,30,"Liam Lawson","LL",null,{"v":25000000,"d":"€ 25,000,000"},{"$nulls":3},{"$f":"CONCATENATE($B$58,\"/\",$B$59)","v":"16/44"},"FERRARI _ Chassis","SF",null,{"v":27000000,"d":"€ 27,000,000"},{"$nulls":4},"Sergio Perez",null,null,25000000]
[null,16,"Charles Leclerc","CL",null,{"v":39000000,"d":"€ 39,000,000"},{"$nulls":3},{"$f":"CONCATENATE($B$60,\"/\",$B$61)","v":"4/81"},"MCLAREN _ Chassis","McL",null,{"v":28000000,"d":"€ 28,000,000"},{"$nulls":4},"Lewis Hamilton",null,null,33000000]
[null,44,"Lewis Hamilton","LW",null,{"v":33000000,"d":"€ 33,000,000"},{"$nulls":3},{"$f":"CONCATENATE($B$62,\"/\",$B$63)","v":"63/12"},"MERCEDES _ Chassis","Mer",null,{"v":22000000,"d":"€ 22,000,000"},{"$nulls":4},"George Russell",null,null,33000000,null,null,{"$f":"25/42","v":{"v":0.5952380952380952,"d":"0.60"}}]
[null,4,"Lando Norris","LN",null,{"v":40000000,"d":"€ 40,000,000"},{"$nulls":3},{"$f":"CONCATENATE($B$64,\"/\",$B$65)","v":"18/14"},"ASTON _ Chassis","AsM",null,{"v":19000000,"d":"€ 19,000,000"},{"$nulls":4},"Charles Leclerc",null,null,39000000,null,null,{"$f":"20/33","v":{"v":0.6060606060606061,"d":"0.61"}}]
[null,81,"Oscar Piastri","OP",null,{"v":38000000,"d":"€ 38,000,000"},{"$nulls":3},{"$f":"CONCATENATE($B$66,\"/\",$B$67)","v":"22/6"},"RACINGBULLS_ Chassis","RaB",null,{"v":15000000,"d":"€ 15,000,000"},{"$nulls":4},"Carlos Sainz Jr.",null,null,36000000,null,null,{"$f":"15*0.6","v":{"v":9,"d":"9.00"}}]
[null,63,"George Russell","GR",null,{"v":33000000,"d":"€ 33,000,000"},{"$nulls":3},{"$f":"CONCATENATE($B$68,\"/\",$B$69)","v":"87/31"},"HAAS _ Chassis","HAA",null,{"v":19000000,"d":"€ 19,000,000"},{"$nulls":4},"Lando Norris",null,null,40000000]
[null,12,"Andrea Kimi Antonelli","AA",null,{"v":20000000,"d":"€ 20,000,000"},{"$nulls":3},{"$f":"CONCATENATE($B$70,\"/\",$B$71)","v":"10/7"},"ALPINE_ Chassis","ALP",null,{"v":15000000,"d":"€ 15,000,000"},{"$nulls":4},"Oscar Piastri",null,null,38000000]
[null,18,"Lance Stroll","LS",null,{"v":14000000,"d":"€ 14,000,000"},{"$nulls":3},{"$f":"CONCATENATE($B$72,\"/\",$B$73)","v":"23/55"},"WILLIAMS_ Chassis","WIL",null,{"v":9000000,"d":"€ 9,000,000"},{"$nulls":4},"Lance Stroll",null,null,14000000]
[null,14,"Fernando Alonso","FA",null,{"v":23000000,"d":"€ 23,000,000"},{"$nulls":3},{"$f":"CONCATENATE($B$74,\"/\",$B$75)","v":"27/5"},"KICK SAUBER_ Chassis","KSA",null,{"v":8000000,"d":"€ 8,000,000"},{"$nulls":4},"Fernando Alonso",null,null,23000000]
[null,22,"Yuki Tsunoda","YT",null,{"v":15000000,"d":"€ 15,000,000"},{"$nulls":3},{"$f":"CONCATENATE($B$76,\"/\",$B$77)","v":"../.."},null,"..",{"$nulls":6},"Esteban Ocon",null,null,13000000]
[null,6,"Isack Hadjar","IH",null,{"v":9000000,"d":"€ 9,000,000"},{"$nulls":3},{"$f":"CONCATENATE($B$78,\"/\",$B$79)","v":"../.."},null,"..",{"$nulls":6},"Pierre Gasly",null,null,16000000]
[null,87,"Olivier Bearman","OB",null,{"v":14000000,"d":"€ 14,000,000"},{"$nulls":3},{"$f":"CONCATENATE($B$80,\"/\",$B$81)","v":"../.."},null,"..",{"$nulls":6},"Alexander Albon",null,null,11000000]
[null,31,"Esteban Ocon","EO",null,{"v":19000000,"d":"€ 19,000,000"},{"$nulls":3},{"$f":"CONCATENATE($B$82,\"/\",$B$83)","v":"../.."},null,"..",{"$nulls":6},"Logan Sargeant",null,null,7000000]
[null,10,"Pierre Gasly","PG",null,{"v":16000000,"d":"€ 16,000,000"},{"$nulls":12},"Daniel Ricciardo",null,null,14000000]
[null,7,"Jack Doohan","JD",null,{"v":10000000,"d":"€ 10,000,000"},{"$nulls":4},"Motor",{"$nulls":7},"Yuki Tsunoda",null,null,15000000]
[null,23,"Alex Albon","AA",null,{"v":11000000,"d":"€ 11,000,000"},{"$nulls":3},{"$f":"CONCATENATE($B$56,\"/\",$B$57)","v":"1/30"},"RED BULL _ Motor","RB",null,{"v":22000000,"d":"€ 22,000,000"},{"$nulls":4},"Valtteri Botas",null,null,7000000]
[null,55,"Carlos Sainz","CZ",null,{"v":11000000,"d":"€ 11,000,000"},{"$nulls":3},{"$f":"CONCATENATE($B$58,\"/\",$B$59)","v":"16/44"},"FERRARI _ Motor","SF",null,{"v":27000000,"d":"€ 27,000,000"},{"$nulls":4},"Guanyu Zhou",null,null,8000000]
[null,27,"Nico Hülkenberg","NH",null,{"v":11000000,"d":"€ 11,000,000"},{"$nulls":3},{"$f":"CONCATENATE($B$60,\"/\",$B$61)","v":"4/81"},"MCLAREN _ Motor","McL",null,{"v":28000000,"d":"€ 28,000,000"},{"$nulls":4},"Nico Hülkenberg",null,null,19000000]
[null,5,"Gabriël Bortoleto","GB",null,{"v":9000000,"d":"€ 9,000,000"},{"$nulls":3},{"$f":"CONCATENATE($B$62,\"/\",$B$63)","v":"63/12"},"MERCEDES _ Motor","Mer",null,{"v":22000000,"d":"€ 22,000,000"},{"$nulls":4},"Kevin Magnussen",null,null,15000000]
[null,"..",null,"..",{"$nulls":5},{"$f":"CONCATENATE($B$64,\"/\",$B$65)","v":"18/14"},"ASTON _ Motor","AsM",null,{"v":19000000,"d":"€ 19,000,000"}]
[null,"..",null,"..",{"$nulls":5},{"$f":"CONCATENATE($B$66,\"/\",$B$67)","v":"22/6"},"RACINGBULLS_ Motor","RaB",null,{"v":15000000,"d":"€ 15,000,000"}]
[null,"..",null,"..",{"$nulls":5},{"$f":"CONCATENATE($B$68,\"/\",$B$69)","v":"87/31"},"HAAS _ Motor","HAA",null,{"v":19000000,"d":"€ 19,000,000"}]
[null,"..",null,"..",{"$nulls":5},{"$f":"CONCATENATE($B$70,\"/\",$B$72)","v":"10/23"},"ALPINE_ Motor","ALP",null,{"v":15000000,"d":"€ 15,000,000"}]
[null,"..",null,"..",{"$nulls":5},{"$f":"CONCATENATE($B$72,\"/\",$B$73)","v":"23/55"},"WILLIAMS_ Motor","WIL",null,{"v":9000000,"d":"€ 9,000,000"}]
[null,"..",null,"..",{"$nulls":5},{"$f":"CONCATENATE($B$74,\"/\",$B$75)","v":"27/5"},"KICK SAUBER_ Motor","KSA",null,{"v":8000000,"d":"€ 8,000,000"}]
[null,"..",null,"..",{"$nulls":5},{"$f":"CONCATENATE($B$76,\"/\",$B$77)","v":"../.."},null,{"$f":"L66","v":".."}]
[null,"..",null,"..",{"$nulls":5},{"$f":"CONCATENATE($B$78,\"/\",$B$79)","v":"../.."},null,{"$f":"L67","v":".."}]
[{"$nulls":9},{"$f":"CONCATENATE($B$80,\"/\",$B$81)","v":"../.."},null,{"$f":"L68","v":".."}]
[null,null,"* Nog niet officieel bevestigd",{"$nulls":6},{"$f":"CONCATENATE($B$82,\"/\",$B$83)","v":"../.."},null,{"$f":"L69","v":".."}]
[null,22]
[{"$nulls":9},{"$f":"IF(J88>1,\"Ok\",\"HOLD\")","v":"HOLD"}]
[null,1,"Tekst laten staan",1,null,"Tekst laten staan",{"$nulls":3},1,"Tekst laten staan"]
[null,null,"Kies hier de wereldkampioen",null,null,"Kies hier joker 1",{"$nulls":4},"Kies hier uw aantal",{"$nulls":4},"01 - Grand Prix van ","Bahrein",", Bahrein",null,"Bah",null,56]
[null,null,{"$f":"C56","v":"Max Verstappen"},null,null,{"$f":"CONCATENATE(P89,Q89,R89)","v":"01 - Grand Prix van Bahrein, Bahrein"},{"$nulls":4},"1 race",{"$nulls":4},"02 - Grand Prix van ","Saoedi-Arabië",", Jeddah",null,"Sao",null,50]
[null,null,{"$f":"C57","v":"Liam Lawson"},null,null,{"$f":"CONCATENATE(P90,Q90,R90)","v":"02 - Grand Prix van Saoedi-Arabië, Jeddah"},{"$nulls":4},"2 races",{"$nulls":4},"03 - Grand Prix van ","Australië",", Albert Park",null,"Aus",null,58]
[null,null,"Charles Leclerc",null,null,"03 - Grand Prix van Australië, Albert Park",{"$nulls":4},"3 races",{"$nulls":4},"04 - Grand Prix van ","Japan",", Suzuka",null,"Jap",null,53]
[null,null,"Lewis Hamilton",null,null,{"$f":"CONCATENATE(P92,Q92,R92)","v":"04 - Grand Prix van Japan, Suzuka"},{"$nulls":4},"4 races",{"$nulls":4},"05 - Grand Prix van ","China",", Shanghai",null,"Chi",null,56]
[null,null,"Lando Norris",null,null,"05 - Grand Prix van China, Shanghai",{"$nulls":4},"5 races",{"$nulls":4},"06 - Grand Prix van ","Verenigde Staten",", Miami",null,"VS",null,57]
[null,null,"Oscar Piastri",null,null,"06 - Grand Prix van Verenigde Staten, Miami",{"$nulls":4},"6 races",{"$nulls":4},"07 - Grand Prix van ","Italië",", Imola",null,"Ita",null,63]
[null,null,"George Russell",null,null,"07 - Grand Prix van Italië, Imola",{"$nulls":4},"7 races",{"$nulls":4},"08 - Grand Prix van ","Monaco",", Monaco",null,"Mon",null,78]
[null,null,"Andrea Kimi Antonelli",1,null,"Tekst laten staan",{"$nulls":4},"8 races",{"$nulls":4},"09 - Grand Prix van ","Canada",", Montreal",null,"Can",null,70]
[null,null,"Lance Stroll",null,null,"Kies hier joker 2",{"$nulls":4},"9 races",{"$nulls":4},"10 - Grand Prix van ","Spanje",", Barcelona",null,"Spa",null,66]
[null,null,"Fernando Alonso",null,null,{"$f":"CONCATENATE(P96,Q96,R96)","v":"08 - Grand Prix van Monaco, Monaco"},{"$nulls":4},"10 races",{"$nulls":4},"11 - Grand Prix van ","Oostenrijk",", A1 Ring",null,"Oos",null,71]
[null,null,"Yuki Tsunoda",null,null,"09 - Grand Prix van Canada, Montreal",{"$nulls":4},"11 races",{"$nulls":4},"12 - Grand Prix van ","Engeland",", Silverstone",null,"Eng",null,52]
[null,null,"Isack Hadjar",null,null,"10 - Grand Prix van Spanje, Barcelona",{"$nulls":4},"12 races",{"$nulls":4},"13 - Grand Prix van ","Hongarije",", Boedapest",null,"Hon",null,70]
[null,null,"Olivier Bearman",null,null,"11 - Grand Prix van Oostenrijk, A1 Ring",{"$nulls":4},"13 races",{"$nulls":4},"14 - Grand Prix van ","België",", Francorchamps",null,"Bel",null,44]
[null,null,"Esteban Ocon",null,null,"12 - Grand Prix van Engeland, Silverstone",{"$nulls":4},"14 races",{"$nulls":4},"15 - Grand Prix van ","Nederland",", Zandvoort",null,"Ned",null,72]
[null,null,"Pierre Gasly",null,null,"13 - Grand Prix van Hongarije, Boedapest",{"$nulls":4},"15 races",{"$nulls":4},"16 - Grand Prix van ","Italië",", Monza",null,"Ita",null,53]
[null,null,"Jack Doohan",null,null,"14 - Grand Prix van België, Francorchamps",{"$nulls":4},"16 races",{"$nulls":4},"17 - Grand Prix van ","Azerbeidzjan",", Baku",null,"Aze",null,51]
[null,null,"Alex Albon",1,null,"Tekst laten staan",{"$nulls":4},"17 races",{"$nulls":4},"18 - Grand Prix van ","Singapore",", Singapore",null,"Sin",null,61]
[null,null,"Carlos Sainz",null,null,"Kies hier joker 3",{"$nulls":4},"18 races",{"$nulls":4},"19 - Grand Prix van ","Verenigde Staten",", Austin",null,"VS",null,56]
[null,null,"Nico Hülkenberg",null,null,{"$f":"CONCATENATE(P103,Q103,R103)","v":"15 - Grand Prix van Nederland, Zandvoort"},{"$nulls":4},"19 races",{"$nulls":4},"20 - Grand Prix van ","Mexico",", Mexico City",null,"Mex",null,71]
[null,null,"Gabriël Bortoleto",null,null,{"$f":"CONCATENATE(P104,Q104,R104)","v":"16 - Grand Prix van Italië, Monza"},{"$nulls":4},"20 races",{"$nulls":4},"21 - Grand Prix van","Brazilië",", Sao Paulo",null,"Bra",null,71]
[null,null,0,null,null,"17 - Grand Prix van Azerbeidzjan, Baku",{"$nulls":4},"21 races",{"$nulls":4},"22 - Grand Prix van","Las Vegas",", Las Vegas",null,"Las",null,50]
[null,null,0,null,null,"18 - Grand Prix van Singapore, Singapore",{"$nulls":4},"22 races",{"$nulls":4},"23 - Grand Prix van","Qatar",", Qatar",null,"Qat",null,57]
[{"$nulls":5},"19 - Grand Prix van Verenigde Staten, Austin",{"$nulls":4},"23 races",{"$nulls":4},"24 - Grand Prix van","Abu Dhabi",", Abu Dhabi",null,"Abd",null,58]
[{"$nulls":5},"20 - Grand Prix van Mexico, Mexico City",{"$nulls":4},"24 races"]
[{"$nulls":5},"21 - Grand Prix vanBrazilië, Sao Paulo"]
[{"$nulls":5},"22 - Grand Prix vanLas Vegas, Las Vegas"]
[{"$nulls":5},"23 - Grand Prix vanQatar, Qatar"]
[{"$nulls":5},"24 - Grand Prix vanAbu Dhabi, Abu Dhabi"]
[]
[null,"A1","2025-03-13T23:59:00"]
[null,"A2",{"$f":"NOW()","v":"2025-02-16T16:59:41"}]
[null,"A3",{"$f":"C119-C120","v":{"v":25.291192129625415,"d":"25"}}]

{"sheet":"F1-Manager (site)","index":1,"n_rows":57,"n_cols":6,"rows_kept":57,"hidden":true,"merged":[[0,0,1,7],[3,1,3,3],[4,1,4,3],[6,1,6,3],[28,1,28,3],[40,1,40,3],[52,1,52,3],[55,1,55,3]]}
[{"$f":"'F1-Manager (invulblad)'!B1","v":"www.haemerke.nl presents \"Formule 1 Manager 2025\""}]
[]
[]
[null,{"$f":"'F1-Manager (invulblad)'!B5:F5","v":0},{"$nulls":3},"Verbruikte budget is"]
[null,{"$f":"'F1-Manager (invulblad)'!B7:F7","v":0},{"$nulls":3},{"$f":"'F1-Manager (invulblad)'!T4","v":{"v":80000000,"d":"€ 80,000,000"}}]
[]
[null,"COUREURS"]
[null,{"$f":"'F1-Manager (invulblad)'!B11","v":1},{"$f":"'F1-Manager (invulblad)'!C11","v":"Max Verstappen"},{"$f":"'F1-Manager (invulblad)'!H11","v":{"v":0,"d":"€ 0"}}]
[null,{"$f":"'F1-Manager (invulblad)'!B12","v":30},{"$f":"'F1-Manager (invulblad)'!C12","v":"Liam Lawson"},{"$f":"'F1-Manager (invulblad)'!H12","v":{"v":0,"d":"€ 0"}}]
[null,{"$f":"'F1-Manager (invulblad)'!B13","v":16},{"$f":"'F1-Manager (invulblad)'!C13","v":"Charles Leclerc"},{"$f":"'F1-Manager (invulblad)'!H13","v":{"v":0,"d":"€ 0"}}]
[null,{"$f":"'F1-Manager (invulblad)'!B14","v":44},{"$f":"'F1-Manager (invulblad)'!C14","v":"Lewis Hamilton"},{"$f":"'F1-Manager (invulblad)'!H14","v":{"v":0,"d":"€ 0"}}]
[null,{"$f":"'F1-Manager (invulblad)'!B15","v":4},{"$f":"'F1-Manager (invulblad)'!C15","v":"Lando Norris"},{"$f":"'F1-Manager (invulblad)'!H15","v":{"v":0,"d":"€ 0"}}]
[null,{"$f":"'F1-Manager (invulblad)'!B16","v":81},{"$f":"'F1-Manager (invulblad)'!C16","v":"Oscar Piastri"},{"$f":"'F1-Manager (invulblad)'!H16","v":{"v":0,"d":"€ 0"}}]
[null,{"$f":"'F1-Manager (invulblad)'!B17","v":63},{"$f":"'F1-Manager (invulblad)'!C17","v":"George Russell"},{"$f":"'F1-Manager (invulblad)'!H17","v":{"v":0,"d":"€ 0"}}]
[null,{"$f":"'F1-Manager (invulblad)'!B18","v":12},{"$f":"'F1-Manager (invulblad)'!C18","v":"Andrea Kimi Antonelli"},{"$f":"'F1-Manager (invulblad)'!H18","v":{"v":0,"d":"€ 0"}}]
[null,{"$f":"'F1-Manager (invulblad)'!B19","v":18},{"$f":"'F1-Manager (invulblad)'!C19","v":"Lance Stroll"},{"$f":"'F1-Manager (invulblad)'!H19","v":{"v":0,"d":"€ 0"}}]
[null,{"$f":"'F1-Manager (invulblad)'!B20","v":14},{"$f":"'F1-Manager (invulblad)'!C20","v":"Fernando Alonso"},{"$f":"'F1-Manager (invulblad)'!H20","v":{"v":0,"d":"€ 0"}}]
[null,{"$f":"'F1-Manager (invulblad)'!B21","v":22},{"$f":"'F1-Manager (invulblad)'!C21","v":"Yuki Tsunoda"},{"$f":"'F1-Manager (invulblad)'!H21","v":{"v":0,"d":"€ 0"}}]
[null,{"$f":"'F1-Manager (invulblad)'!B22","v":6},{"$f":"'F1-Manager (invulblad)'!C22","v":"Isack Hadjar"},{"$f":"'F1-Manager (invulblad)'!H22","v":{"v":0,"d":"€ 0"}}]
[null,{"$f":"'F1-Manager (invulblad)'!B23","v":87},{"$f":"'F1-Manager (invulblad)'!C23","v":"Olivier Bearman"},{"$f":"'F1-Manager (invulblad)'!H23","v":{"v":0,"d":"€ 0"}}]
[null,{"$f":"'F1-Manager (invulblad)'!B24","v":31},{"$f":"'F1-Manager (invulblad)'!C24","v":"Esteban Ocon"},{"$f":"'F1-Manager (invulblad)'!H24","v":{"v":0,"d":"€ 0"}}]
[null,{"$f":"'F1-Manager (invulblad)'!B25","v":10},{"$f":"'F1-Manager (invulblad)'!C25","v":"Pierre Gasly"},{"$f":"'F1-Manager (invulblad)'!H25","v":{"v":0,"d":"€ 0"}}]
[null,{"$f":"'F1-Manager (invulblad)'!B26","v":7},{"$f":"'F1-Manager (invulblad)'!C26","v":"Jack Doohan"},{"$f":"'F1-Manager (invulblad)'!H26","v":{"v":0,"d":"€ 0"}}]
[null,{"$f":"'F1-Manager (invulblad)'!B27","v":23},{"$f":"'F1-Manager (invulblad)'!C27","v":"Alex Albon"},{"$f":"'F1-Manager (invulblad)'!H27","v":{"v":0,"d":"€ 0"}}]
[null,{"$f":"'F1-Manager (invulblad)'!B28","v":55},{"$f":"'F1-Manager (invulblad)'!C28","v":"Carlos Sainz"},{"$f":"'F1-Manager (invulblad)'!H28","v":{"v":0,"d":"€ 0"}}]
[null,{"$f":"'F1-Manager (invulblad)'!B29","v":27},{"$f":"'F1-Manager (invulblad)'!C29","v":"Nico Hülkenberg"},{"$f":"'F1-Manager (invulblad)'!H29","v":{"v":0,"d":"€ 0"}}]
[null,{"$f":"'F1-Manager (invulblad)'!B30","v":5},{"$f":"'F1-Manager (invulblad)'!C30","v":"Gabriël Bortoleto"},{"$f":"'F1-Manager (invulblad)'!H30","v":{"v":0,"d":"€ 0"}}]
[]
[null,"CHASSIS"]
[null,{"$f":"'F1-Manager (invulblad)'!J11","v":"1/30"},{"$f":"'F1-Manager (invulblad)'!K11","v":"RED BULL _ Chassis"},{"$f":"'F1-Manager (invulblad)'!P11","v":{"v":0,"d":"€ 0"}}]
[null,{"$f":"'F1-Manager (invulblad)'!J12","v":"16/44"},{"$f":"'F1-Manager (invulblad)'!K12","v":"FERRARI _ Chassis"},{"$f":"'F1-Manager (invulblad)'!P12","v":{"v":0,"d":"€ 0"}}]
[null,{"$f":"'F1-Manager (invulblad)'!J13","v":"4/81"},{"$f":"'F1-Manager (invulblad)'!K13","v":"MCLAREN _ Chassis"},{"$f":"'F1-Manager (invulblad)'!P13","v":{"v":0,"d":"€ 0"}}]
[null,{"$f":"'F1-Manager (invulblad)'!J14","v":"63/12"},{"$f":"'F1-Manager (invulblad)'!K14","v":"MERCEDES _ Chassis"},{"$f":"'F1-Manager (invulblad)'!P14","v":{"v":0,"d":"€ 0"}}]
[null,{"$f":"'F1-Manager (invulblad)'!J15","v":"18/14"},{"$f":"'F1-Manager (invulblad)'!K15","v":"ASTON _ Chassis"},{"$f":"'F1-Manager (invulblad)'!P15","v":{"v":0,"d":"€ 0"}}]
[null,{"$f":"'F1-Manager (invulblad)'!J16","v":"22/6"},{"$f":"'F1-Manager (invulblad)'!K16","v":"RACINGBULLS_ Chassis"},{"$f":"'F1-Manager (invulblad)'!P16","v":{"v":0,"d":"€ 0"}}]
[null,{"$f":"'F1-Manager (invulblad)'!J17","v":"87/31"},{"$f":"'F1-Manager (invulblad)'!K17","v":"HAAS _ Chassis"},{"$f":"'F1-Manager (invulblad)'!P17","v":{"v":0,"d":"€ 0"}}]
[null,{"$f":"'F1-Manager (invulblad)'!J18","v":"10/7"},{"$f":"'F1-Manager (invulblad)'!K18","v":"ALPINE_ Chassis"},{"$f":"'F1-Manager (invulblad)'!P18","v":{"v":0,"d":"€ 0"}}]
[null,{"$f":"'F1-Manager (invulblad)'!J19","v":"23/55"},{"$f":"'F1-Manager (invulblad)'!K19","v":"WILLIAMS_ Chassis"},{"$f":"'F1-Manager (invulblad)'!P19","v":{"v":0,"d":"€ 0"}}]
[null,{"$f":"'F1-Manager (invulblad)'!J20","v":"27/5"},{"$f":"'F1-Manager (invulblad)'!K20","v":"KICK SAUBER_ Chassis"},{"$f":"'F1-Manager (invulblad)'!P20","v":{"v":0,"d":"€ 0"}}]
[]
[null,"MOTOR"]
[null,{"$f":"'F1-Manager (invulblad)'!R11","v":"1/30"},{"$f":"'F1-Manager (invulblad)'!S11","v":"RED BULL _ Motor"},{"$f":"'F1-Manager (invulblad)'!X11","v":{"v":0,"d":"€ 0"}}]
[null,{"$f":"'F1-Manager (invulblad)'!R12","v":"16/44"},{"$f":"'F1-Manager (invulblad)'!S12","v":"FERRARI _ Motor"},{"$f":"'F1-Manager (invulblad)'!X12","v":{"v":0,"d":"€ 0"}}]
[null,{"$f":"'F1-Manager (invulblad)'!R13","v":"4/81"},{"$f":"'F1-Manager (invulblad)'!S13","v":"MCLAREN _ Motor"},{"$f":"'F1-Manager (invulblad)'!X13","v":{"v":0,"d":"€ 0"}}]
[null,{"$f":"'F1-Manager (invulblad)'!R14","v":"63/12"},{"$f":"'F1-Manager (invulblad)'!S14","v":"MERCEDES _ Motor"},{"$f":"'F1-Manager (invulblad)'!X14","v":{"v":0,"d":"€ 0"}}]
[null,{"$f":"'F1-Manager (invulblad)'!R15","v":"18/14"},{"$f":"'F1-Manager (invulblad)'!S15","v":"ASTON _ Motor"},{"$f":"'F1-Manager (invulblad)'!X15","v":{"v":0,"d":"€ 0"}}]
[null,{"$f":"'F1-Manager (invulblad)'!R16","v":"22/6"},{"$f":"'F1-Manager (invulblad)'!S16","v":"RACINGBULLS_ Motor"},{"$f":"'F1-Manager (invulblad)'!X16","v":{"v":0,"d":"€ 0"}}]
[null,{"$f":"'F1-Manager (invulblad)'!R17","v":"87/31"},{"$f":"'F1-Manager (invulblad)'!S17","v":"HAAS _ Motor"},{"$f":"'F1-Manager (invulblad)'!X17","v":{"v":0,"d":"€ 0"}}]
[null,{"$f":"'F1-Manager (invulblad)'!R18","v":"10/23"},{"$f":"'F1-Manager (invulblad)'!S18","v":"ALPINE_ Motor"},{"$f":"'F1-Manager (invulblad)'!X18","v":{"v":0,"d":"€ 0"}}]
[null,{"$f":"'F1-Manager (invulblad)'!R19","v":"23/55"},{"$f":"'F1-Manager (invulblad)'!S19","v":"WILLIAMS_ Motor"},{"$f":"'F1-Manager (invulblad)'!X19","v":{"v":0,"d":"€ 0"}}]
[null,{"$f":"'F1-Manager (invulblad)'!R20","v":"27/5"},{"$f":"'F1-Manager (invulblad)'!S20","v":"KICK SAUBER_ Motor"},{"$f":"'F1-Manager (invulblad)'!X20","v":{"v":0,"d":"€ 0"}}]
[]
[null,"Wereldkampioen"]
[null,{"$f":"IF('F1-Manager (invulblad)'!B88=2,'F1-Manager (invulblad)'!C90,IF('F1-Manager (invulblad)'!B88=3,'F1-Manager (invulblad)'!C91,IF('F1-Manager (invulblad)'!B88=4,'F1-Manager (invulblad)'!C92,IF('F1-Manager (invulblad)'!B88=5,'F1-Manager (invulblad)'!C93,IF('F1-Manager (invulblad)'!B88=6,'F1-Manager (invulblad)'!C94,IF('F1-Manager (invulblad)'!B88=7,'F1-Manager (invulblad)'!C95,IF('F1-Manager (invulblad)'!B88=8,'F1-Manager (invulblad)'!C96,IF('F1-Manager (invulblad)'!B88=9,'F1-Manager (invulblad)'!C97,IF('F1-Manager (invulblad)'!B88=10,'F1-Manager (invulblad)'!C98,IF('F1-Manager (invulblad)'!B88=11,'F1-Manager (invulblad)'!C99,IF('F1-Manager (invulblad)'!B88=12,'F1-Manager (invulblad)'!C100,IF('F1-Manager (invulblad)'!B88=13,'F1-Manager (invulblad)'!C101,IF('F1-Manager (invulblad)'!B88=14,'F1-Manager (invulblad)'!C102,IF('F1-Manager (invulblad)'!B88=15,'F1-Manager (invulblad)'!C103,IF('F1-Manager (invulblad)'!B88=16,'F1-Manager (invulblad)'!C104,IF('F1-Manager (invulblad)'!B88=17,'F1-Manager (invulblad)'!C105,IF('F1-Manager (invulblad)'!B88=18,'F1-Manager (invulblad)'!C106,IF('F1-Manager (invulblad)'!B88=19,'F1-Manager (invulblad)'!C107,IF('F1-Manager (invulblad)'!B88=20,'F1-Manager (invulblad)'!C108,IF('F1-Manager (invulblad)'!B88=21,'F1-Manager (invulblad)'!C109,IF('F1-Manager (invulblad)'!B88=22,'F1-Manager (invulblad)'!C110,IF('F1-Manager (invulblad)'!B88=23,'F1-Manager (invulblad)'!C111,IF('F1-Manager (invulblad)'!B88=24,'F1-Manager (invulblad)'!C112,IF('F1-Manager (invulblad)'!B88=25,'F1-Manager (invulblad)'!C113,\"Wie wordt er wereldkampioen\"))))))))))))))))))))))))","v":"Wie wordt er wereldkampioen"}]
[]
[null,"Barragevraag"]
[null,{"$f":"IF('F1-Manager (invulblad)'!J88=2,'F1-Manager (invulblad)'!K90,IF('F1-Manager (invulblad)'!J88=3,'F1-Manager (invulblad)'!K91,IF('F1-Manager (invulblad)'!J88=4,'F1-Manager (invulblad)'!K92,IF('F1-Manager (invulblad)'!J88=5,'F1-Manager (invulblad)'!K93,IF('F1-Manager (invulblad)'!J88=6,'F1-Manager (invulblad)'!K94,IF('F1-Manager (invulblad)'!J88=7,'F1-Manager (invulblad)'!K95,IF('F1-Manager (invulblad)'!J88=8,'F1-Manager (invulblad)'!K96,IF('F1-Manager (invulblad)'!J88=9,'F1-Manager (invulblad)'!K97,IF('F1-Manager (invulblad)'!J88=10,'F1-Manager (invulblad)'!K98,IF('F1-Manager (invulblad)'!J88=11,'F1-Manager (invulblad)'!K99,IF('F1-Manager (invulblad)'!J88=12,'F1-Manager (invulblad)'!K100,IF('F1-Manager (invulblad)'!J88=13,'F1-Manager (invulblad)'!K101,IF('F1-Manager (invulblad)'!J88=14,'F1-Manager (invulblad)'!K102,IF('F1-Manager (invulblad)'!J88=15,'F1-Manager (invulblad)'!K103,IF('F1-Manager (invulblad)'!J88=16,'F1-Manager (invulblad)'!K104,IF('F1-Manager (invulblad)'!J88=17,'F1-Manager (invulblad)'!K105,IF('F1-Manager (invulblad)'!J88=18,'F1-Manager (invulblad)'!K106,IF('F1-Manager (invulblad)'!J88=19,'F1-Manager (invulblad)'!K107,IF('F1-Manager (invulblad)'!J88=20,'F1-Manager (invulblad)'!K108,IF('F1-Manager (invulblad)'!J88=21,'F1-Manager (invulblad)'!K109,IF('F1-Manager (invulblad)'!J88=22,'F1-Manager (invulblad)'!K110,IF('F1-Manager (invulblad)'!J88=23,'F1-Manager (invulblad)'!K111,IF('F1-Manager (invulblad)'!J88=24,'F1-Manager (invulblad)'!K112,IF('F1-Manager (invulblad)'!J88=25,'F1-Manager (invulblad)'!K113,\"Hoeveel Grand Prix wedstrijden zal de wereldkampioen winnen?\"))))))))))))))))))))))))","v":"Hoeveel Grand Prix wedstrijden zal de wereldkampioen winnen?"}]

{"sheet":"F1-Manager (invulbladExcel)","index":2,"n_rows":3,"n_cols":147,"rows_kept":3,"hidden":true,"merged":[[0,1,1,1],[0,30,1,30],[0,45,1,45],[0,60,1,60],[0,85,1,85],[0,88,1,88],[0,117,1,117]]}
[null,"Coureurs",{"$f":"'F1-Manager (invulblad)'!$B$56","v":1},{"$f":"'F1-Manager (invulblad)'!$B$57","v":30},{"$f":"'F1-Manager (invulblad)'!$B$58","v":16},{"$f":"'F1-Manager (invulblad)'!$B$59","v":44},{"$f":"'F1-Manager (invulblad)'!$B$60","v":4},{"$f":"'F1-Manager (invulblad)'!$B$61","v":81},{"$f":"'F1-Manager (invulblad)'!$B$62","v":63},{"$f":"'F1-Manager (invulblad)'!$B$63","v":12},{"$f":"'F1-Manager (invulblad)'!$B$64","v":18},{"$f":"'F1-Manager (invulblad)'!$B$65","v":14},{"$f":"'F1-Manager (invulblad)'!$B$66","v":22},{"$f":"'F1-Manager (invulblad)'!$B$67","v":6},{"$f":"'F1-Manager (invulblad)'!$B$68","v":87},{"$f":"'F1-Manager (invulblad)'!$B$69","v":31},{"$f":"'F1-Manager (invulblad)'!$B$70","v":10},{"$f":"'F1-Manager (invulblad)'!$B$71","v":7},{"$f":"'F1-Manager (invulblad)'!$B$72","v":23},{"$f":"'F1-Manager (invulblad)'!$B$73","v":55},{"$f":"'F1-Manager (invulblad)'!$B$74","v":27},{"$f":"'F1-Manager (invulblad)'!$B$75","v":5},{"$f":"'F1-Manager (invulblad)'!$B$76","v":".."},{"$f":"'F1-Manager (invulblad)'!$B$77","v":".."},{"$f":"'F1-Manager (invulblad)'!$B$78","v":".."},{"$f":"'F1-Manager (invulblad)'!$B$79","v":".."},{"$f":"'F1-Manager (invulblad)'!$B$80","v":".."},{"$f":"'F1-Manager (invulblad)'!$B$81","v":".."},{"$f":"'F1-Manager (invulblad)'!$B$82","v":".."},{"$f":"'F1-Manager (invulblad)'!$B$83","v":".."},"Chassis",{"$f":"'F1-Manager (invulblad)'!$J$56","v":"1/30"},{"$f":"'F1-Manager (invulblad)'!$J$57","v":"16/44"},{"$f":"'F1-Manager (invulblad)'!$J$58","v":"4/81"},{"$f":"'F1-Manager (invulblad)'!$J$59","v":"63/12"},{"$f":"'F1-Manager (invulblad)'!$J$60","v":"18/14"},{"$f":"'F1-Manager (invulblad)'!$J$61","v":"22/6"},{"$f":"'F1-Manager (invulblad)'!$J$62","v":"87/31"},{"$f":"'F1-Manager (invulblad)'!$J$63","v":"10/7"},{"$f":"'F1-Manager (invulblad)'!$J$64","v":"23/55"},{"$f":"'F1-Manager (invulblad)'!$J$65","v":"27/5"},{"$f":"'F1-Manager (invulblad)'!$J$66","v":"../.."},{"$f":"'F1-Manager (invulblad)'!$J$67","v":"../.."},{"$f":"'F1-Manager (invulblad)'!$J$68","v":"../.."},{"$f":"'F1-Manager (invulblad)'!$J$69","v":"../.."},"Motor",{"$f":"AF1","v":"1/30"},{"$f":"AG1","v":"16/44"},"4/81","63/12","18/14","22/6","87/31","10/7","23/55","27/5","../..","../..",{"$f":"AR1","v":"../.."},{"$f":"AS1","v":"../.."},"Jokers",1,2,3,4,5,6,7,8,9,10,11,12,13,14,15,16,17,18,19,20,21,22,23,24,"Banden",null,null,"Kampioen",{"$f":"C1","v":1},{"$f":"D1","v":30},16,44,4,81,63,12,18,14,22,6,87,31,10,7,23,55,27,5,"..","..","..","..","..","..","..","..","Barragevraag"]
[null,null,{"$f":"'F1-Manager (invulblad)'!$D$56","v":"MV"},{"$f":"'F1-Manager (invulblad)'!$D$57","v":"LL"},{"$f":"'F1-Manager (invulblad)'!$D$58","v":"CL"},{"$f":"'F1-Manager (invulblad)'!$D$59","v":"LW"},{"$f":"'F1-Manager (invulblad)'!$D$60","v":"LN"},{"$f":"'F1-Manager (invulblad)'!$D$61","v":"OP"},{"$f":"'F1-Manager (invulblad)'!$D$62","v":"GR"},{"$f":"'F1-Manager (invulblad)'!$D$63","v":"AA"},{"$f":"'F1-Manager (invulblad)'!$D$64","v":"LS"},{"$f":"'F1-Manager (invulblad)'!$D$65","v":"FA"},{"$f":"'F1-Manager (invulblad)'!$D$66","v":"YT"},{"$f":"'F1-Manager (invulblad)'!$D$67","v":"IH"},{"$f":"'F1-Manager (invulblad)'!$D$68","v":"OB"},{"$f":"'F1-Manager (invulblad)'!$D$69","v":"EO"},{"$f":"'F1-Manager (invulblad)'!$D$70","v":"PG"},{"$f":"'F1-Manager (invulblad)'!$D$71","v":"JD"},{"$f":"'F1-Manager (invulblad)'!$D$72","v":"AA"},{"$f":"'F1-Manager (invulblad)'!$D$73","v":"CZ"},{"$f":"'F1-Manager (invulblad)'!$D$74","v":"NH"},{"$f":"'F1-Manager (invulblad)'!$D$75","v":"GB"},{"$f":"'F1-Manager (invulblad)'!$D$76","v":".."},{"$f":"'F1-Manager (invulblad)'!$D$77","v":".."},{"$f":"'F1-Manager (invulblad)'!$D$78","v":".."},{"$f":"'F1-Manager (invulblad)'!$D$79","v":".."},{"$f":"'F1-Manager (invulblad)'!$D$80","v":".."},{"$f":"'F1-Manager (invulblad)'!$D$81","v":".."},{"$f":"'F1-Manager (invulblad)'!$D$82","v":".."},{"$f":"'F1-Manager (invulblad)'!$D$83","v":".."},null,{"$f":"'F1-Manager (invulblad)'!$L$56","v":"RB"},{"$f":"'F1-Manager (invulblad)'!$L$57","v":"SF"},{"$f":"'F1-Manager (invulblad)'!$L$58","v":"McL"},{"$f":"'F1-Manager (invulblad)'!$L$59","v":"Mer"},{"$f":"'F1-Manager (invulblad)'!$L$60","v":"AsM"},{"$f":"'F1-Manager (invulblad)'!$L$61","v":"RaB"},{"$f":"'F1-Manager (invulblad)'!$L$62","v":"HAA"},{"$f":"'F1-Manager (invulblad)'!$L$63","v":"ALP"},{"$f":"'F1-Manager (invulblad)'!$L$64","v":"WIL"},{"$f":"'F1-Manager (invulblad)'!$L$65","v":"KSA"},{"$f":"'F1-Manager (invulblad)'!$L$66","v":".."},{"$f":"'F1-Manager (invulblad)'!$L$67","v":".."},{"$f":"'F1-Manager (invulblad)'!$L$68","v":".."},{"$f":"'F1-Manager (invulblad)'!$L$69","v":".."},null,{"$f":"AF2","v":"RB"},"SF","McL","Mer","AsM","RaB","HAA","ALP","WIL","KSA","..","..",{"$f":"AR2","v":".."},"..",null,{"$f":"'F1-Manager (invulblad)'!S89","v":0},{"$f":"'F1-Manager (invulblad)'!S90","v":0},{"$f":"'F1-Manager (invulblad)'!S91","v":0},{"$f":"'F1-Manager (invulblad)'!S92","v":0},{"$f":"'F1-Manager (invulblad)'!S93","v":0},{"$f":"'F1-Manager (invulblad)'!S94","v":0},{"$f":"'F1-Manager (invulblad)'!S95","v":0},{"$f":"'F1-Manager (invulblad)'!S96","v":0},{"$f":"'F1-Manager (invulblad)'!S97","v":0},{"$f":"'F1-Manager (invulblad)'!S98","v":0},{"$f":"'F1-Manager (invulblad)'!S99","v":0},{"$f":"'F1-Manager (invulblad)'!S100","v":0},{"$f":"'F1-Manager (invulblad)'!S101","v":0},{"$f":"'F1-Manager (invulblad)'!S102","v":0},{"$f":"'F1-Manager (invulblad)'!S103","v":0},{"$f":"'F1-Manager (invulblad)'!S104","v":0},{"$f":"'F1-Manager (invulblad)'!S105","v":0},{"$f":"'F1-Manager (invulblad)'!S106","v":0},{"$f":"'F1-Manager (invulblad)'!S107","v":0},{"$f":"'F1-Manager (invulblad)'!S108","v":0},{"$f":"'F1-Manager (invulblad)'!S109","v":0},{"$f":"'F1-Manager (invulblad)'!S110","v":0},{"$f":"'F1-Manager (invulblad)'!S111","v":0},{"$f":"'F1-Manager (invulblad)'!S112","v":0},null,"PIR",{"$f":"'F1-Manager (invulblad)'!V112","v":58},null,{"$f":"C2","v":"MV"},"LL","CL","LW","LN","OP","GR","AA","LS","FA","YT","IH","OB","EO","PG","JD","AA","CZ","NH","GB","..","..","..","..","..","..","..","..",null,1,2,3,4,5,6,7,8,9,10,11,12,13,14,15,16,17,18,19,20,21,22,23,24]
["Invulling",null,{"$f":"IF('F1-Manager (invulblad)'!$H$11>0,1,\" \")","v":" "},{"$f":"IF('F1-Manager (invulblad)'!$H$12>0,1,\" \")","v":" "},{"$f":"IF('F1-Manager (invulblad)'!$H$13>0,1,\" \")","v":" "},{"$f":"IF('F1-Manager (invulblad)'!$H$14>0,1,\" \")","v":" "},{"$f":"IF('F1-Manager (invulblad)'!$H$15>0,1,\" \")","v":" "},{"$f":"IF('F1-Manager (invulblad)'!$H$16>0,1,\" \")","v":" "},{"$f":"IF('F1-Manager (invulblad)'!$H$17>0,1,\" \")","v":" "},{"$f":"IF('F1-Manager (invulblad)'!$H$18>0,1,\" \")","v":" "},{"$f":"IF('F1-Manager (invulblad)'!$H$19>0,1,\" \")","v":" "},{"$f":"IF('F1-Manager (invulblad)'!$H$20>0,1,\" \")","v":" "},{"$f":"IF('F1-Manager (invulblad)'!$H$21>0,1,\" \")","v":" "},{"$f":"IF('F1-Manager (invulblad)'!$H$22>0,1,\" \")","v":" "},{"$f":"IF('F1-Manager (invulblad)'!$H$23>0,1,\" \")","v":" "},{"$f":"IF('F1-Manager (invulblad)'!$H$24>0,1,\" \")","v":" "},{"$f":"IF('F1-Manager (invulblad)'!$H$25>0,1,\" \")","v":" "},{"$f":"IF('F1-Manager (invulblad)'!$H$26>0,1,\" \")","v":" "},{"$f":"IF('F1-Manager (invulblad)'!$H$27>0,1,\" \")","v":" "},{"$f":"IF('F1-Manager (invulblad)'!$H$28>0,1,\" \")","v":" "},{"$f":"IF('F1-Manager (invulblad)'!$H$29>0,1,\" \")","v":" "},{"$f":"IF('F1-Manager (invulblad)'!$H$30>0,1,\" \")","v":" "},{"$f":"IF('F1-Manager (invulblad)'!$H$31>0,1,\" \")","v":" "},{"$f":"IF('F1-Manager (invulblad)'!$H$32>0,1,\" \")","v":" "},{"$nulls":7},{"$f":"IF('F1-Manager (invulblad)'!$L$11>0,1,\" \")","v":" "},{"$f":"IF('F1-Manager (invulblad)'!$L$12>0,1,\" \")","v":" "},{"$f":"IF('F1-Manager (invulblad)'!$L$13>0,1,\" \")","v":" "},{"$f":"IF('F1-Manager (invulblad)'!$L$14>0,1,\" \")","v":" "},{"$f":"IF('F1-Manager (invulblad)'!$L$15>0,1,\" \")","v":" "},{"$f":"IF('F1-Manager (invulblad)'!$L$16>0,1,\" \")","v":" "},{"$f":"IF('F1-Manager (invulblad)'!$L$17>0,1,\" \")","v":" "},{"$f":"IF('F1-Manager (invulblad)'!$L$18>0,1,\" \")","v":" "},{"$f":"IF('F1-Manager (invulblad)'!$L$19>0,1,\" \")","v":" "},{"$f":"IF('F1-Manager (invulblad)'!$L$20>0,1,\" \")","v":" "},{"$f":"IF('F1-Manager (invulblad)'!$L$21>0,1,\" \")","v":" "},{"$f":"IF('F1-Manager (invulblad)'!$L$22>0,1,\" \")","v":" "},{"$f":"IF('F1-Manager (invulblad)'!$L$23>0,1,\" \")","v":" "},{"$f":"IF('F1-Manager (invulblad)'!$L$24>0,1,\" \")","v":" "},null,{"$f":"IF('F1-Manager (invulblad)'!$T$11>0,1,\" \")","v":" "},{"$f":"IF('F1-Manager (invulblad)'!$T$12>0,1,\" \")","v":" "},{"$f":"IF('F1-Manager (invulblad)'!$T$13>0,1,\" \")","v":" "},{"$f":"IF('F1-Manager (invulblad)'!$T$14>0,1,\" \")","v":" "},{"$f":"IF('F1-Manager (invulblad)'!$T$15>0,1,\" \")","v":" "},{"$f":"IF('F1-Manager (invulblad)'!$T$16>0,1,\" \")","v":" "},{"$f":"IF('F1-Manager (invulblad)'!$T$17>0,1,\" \")","v":" "},{"$f":"IF('F1-Manager (invulblad)'!$T$18>0,1,\" \")","v":" "},{"$f":"IF('F1-Manager (invulblad)'!$T$19>0,1,\" \")","v":" "},{"$f":"IF('F1-Manager (invulblad)'!$T$20>0,1,\" \")","v":" "},{"$f":"IF('F1-Manager (invulblad)'!$T$21>0,1,\" \")","v":" "},{"$f":"IF('F1-Manager (invulblad)'!$T$22>0,1,\" \")","v":" "},{"$f":"IF('F1-Manager (invulblad)'!$T$23>0,1,\" \")","v":" "},{"$f":"IF('F1-Manager (invulblad)'!$T$24>0,1,\" \")","v":" "},null,{"$f":"IF('F1-Manager (invulblad)'!C88=2,1,\" \")","v":" "},{"$f":"IF('F1-Manager (invulblad)'!C88=3,1,\" \")","v":" "},{"$f":"IF('F1-Manager (invulblad)'!C88=4,1,\" \")","v":" "},{"$f":"IF('F1-Manager (invulblad)'!C88=5,1,\" \")","v":" "},{"$f":"IF('F1-Manager (invulblad)'!C88=6,1,\" \")","v":" "},{"$f":"IF('F1-Manager (invulblad)'!C88=7,1,\" \")","v":" "},{"$f":"IF('F1-Manager (invulblad)'!C88=8,1,\" \")","v":" "},{"$f":"IF('F1-Manager (invulblad)'!C97=2,1,\" \")","v":" "},{"$f":"IF('F1-Manager (invulblad)'!C97=3,1,\" \")","v":" "},{"$f":"IF('F1-Manager (invulblad)'!C97=4,1,\" \")","v":" "},{"$f":"IF('F1-Manager (invulblad)'!C97=5,1,\" \")","v":" "},{"$f":"IF('F1-Manager (invulblad)'!C97=6,1,\" \")","v":" "},{"$f":"IF('F1-Manager (invulblad)'!C97=7,1,\" \")","v":" "},{"$f":"IF('F1-Manager (invulblad)'!C97=8,1,\" \")","v":" "},{"$f":"IF('F1-Manager (invulblad)'!C106=2,1,\" \")","v":" "},{"$f":"IF('F1-Manager (invulblad)'!C106=3,1,\" \")","v":" "},{"$f":"IF('F1-Manager (invulblad)'!C106=4,1,\" \")","v":" "},{"$f":"IF('F1-Manager (invulblad)'!C106=5,1,\" \")","v":" "},{"$f":"IF('F1-Manager (invulblad)'!C106=6,1,\" \")","v":" "},{"$f":"IF('F1-Manager (invulblad)'!C106=7,1,\" \")","v":" "},{"$f":"IF('F1-Manager (invulblad)'!C106=8,1,\" \")","v":" "},{"$f":"IF('F1-Manager (invulblad)'!C106=9,1,\" \")","v":" "},{"$f":"IF('F1-Manager (invulblad)'!C106=10,1,\" \")","v":" "},{"$f":"IF('F1-Manager (invulblad)'!C106=11,1,\" \")","v":" "},{"$nulls":4},{"$f":"IF('F1-Manager (invulblad)'!$B$88=2,1,\" \")","v":" "},{"$f":"IF('F1-Manager (invulblad)'!$B$88=3,1,\" \")","v":" "},{"$f":"IF('F1-Manager (invulblad)'!$B$88=4,1,\" \")","v":" "},{"$f":"IF('F1-Manager (invulblad)'!$B$88=5,1,\" \")","v":" "},{"$f":"IF('F1-Manager (invulblad)'!$B$88=6,1,\" \")","v":" "},{"$f":"IF('F1-Manager (invulblad)'!$B$88=7,1,\" \")","v":" "},{"$f":"IF('F1-Manager (invulblad)'!$B$88=8,1,\" \")","v":" "},{"$f":"IF('F1-Manager (invulblad)'!$B$88=9,1,\" \")","v":" "},{"$f":"IF('F1-Manager (invulblad)'!$B$88=10,1,\" \")","v":" "},{"$f":"IF('F1-Manager (invulblad)'!$B$88=11,1,\" \")","v":" "},{"$f":"IF('F1-Manager (invulblad)'!$B$88=12,1,\" \")","v":" "},{"$f":"IF('F1-Manager (invulblad)'!$B$88=13,1,\" \")","v":" "},{"$f":"IF('F1-Manager (invulblad)'!$B$88=14,1,\" \")","v":" "},{"$f":"IF('F1-Manager (invulblad)'!$B$88=15,1,\" \")","v":" "},{"$f":"IF('F1-Manager (invulblad)'!$B$88=16,1,\" \")","v":" "},{"$f":"IF('F1-Manager (invulblad)'!$B$88=17,1,\" \")","v":" "},{"$f":"IF('F1-Manager (invulblad)'!$B$88=18,1,\" \")","v":" "},{"$f":"IF('F1-Manager (invulblad)'!$B$88=19,1,\" \")","v":" "},{"$f":"IF('F1-Manager (invulblad)'!$B$88=20,1,\" \")","v":" "},{"$f":"IF('F1-Manager (invulblad)'!$B$88=21,1,\" \")","v":" "},{"$f":"IF('F1-Manager (invulblad)'!$B$88=22,1,\" \")","v":" "},{"$f":"IF('F1-Manager (invulblad)'!$B$88=23,1,\" \")","v":" "},{"$f":"IF('F1-Manager (invulblad)'!$B$88=24,1,\" \")","v":" "},{"$f":"IF('F1-Manager (invulblad)'!$B$88=25,1,\" \")","v":" "},{"$f":"IF('F1-Manager (invulblad)'!$B$88=26,1,\" \")","v":" "},{"$f":"IF('F1-Manager (invulblad)'!$B$88=27,1,\" \")","v":" "},{"$f":"IF('F1-Manager (invulblad)'!$B$88=28,1,\" \")","v":" "},{"$f":"IF('F1-Manager (invulblad)'!$B$88=29,1,\" \")","v":" "},null,{"$f":"IF('F1-Manager (invulblad)'!$J$88=2,1,\" \")","v":" "},{"$f":"IF('F1-Manager (invulblad)'!$J$88=3,1,\" \")","v":" "},{"$f":"IF('F1-Manager (invulblad)'!$J$88=4,1,\" \")","v":" "},{"$f":"IF('F1-Manager (invulblad)'!$J$88=5,1,\" \")","v":" "},{"$f":"IF('F1-Manager (invulblad)'!$J$88=6,1,\" \")","v":" "},{"$f":"IF('F1-Manager (invulblad)'!$J$88=7,1,\" \")","v":" "},{"$f":"IF('F1-Manager (invulblad)'!$J$88=8,1,\" \")","v":" "},{"$f":"IF('F1-Manager (invulblad)'!$J$88=9,1,\" \")","v":" "},{"$f":"IF('F1-Manager (invulblad)'!$J$88=10,1,\" \")","v":" "},{"$f":"IF('F1-Manager (invulblad)'!$J$88=11,1,\" \")","v":" "},{"$f":"IF('F1-Manager (invulblad)'!$J$88=12,1,\" \")","v":" "},{"$f":"IF('F1-Manager (invulblad)'!$J$88=13,1,\" \")","v":" "},{"$f":"IF('F1-Manager (invulblad)'!$J$88=14,1,\" \")","v":" "},{"$f":"IF('F1-Manager (invulblad)'!$J$88=15,1,\" \")","v":" "},{"$f":"IF('F1-Manager (invulblad)'!$J$88=16,1,\" \")","v":" "},{"$f":"IF('F1-Manager (invulblad)'!$J$88=17,1,\" \")","v":" "},{"$f":"IF('F1-Manager (invulblad)'!$J$88=18,1,\" \")","v":" "},{"$f":"IF('F1-Manager (invulblad)'!$J$88=19,1,\" \")","v":" "},{"$f":"IF('F1-Manager (invulblad)'!$J$88=20,1,\" \")","v":" "},{"$f":"IF('F1-Manager (invulblad)'!$J$88=21,1,\" \")","v":" "},{"$f":"IF('F1-Manager (invulblad)'!$J$88=22,1,\" \")","v":" "},{"$f":"IF('F1-Manager (invulblad)'!$J$88=23,1,\" \")","v":" "},{"$f":"IF('F1-Manager (invulblad)'!$J$88=24,1,\" \")","v":" "},{"$f":"IF('F1-Manager (invulblad)'!$J$88=25,1,\" \")","v":" "},{"$nulls":4},{"$f":"'F1-Manager (invulblad)'!T4","v":{"v":80000000,"d":"€ 80,000,000"}}]

{"sheet":"Waardebepaling","index":3,"n_rows":50,"n_cols":31,"rows_kept":50,"hidden":true}
[null,null,1,2,3,4,5,6,7,8,9,10,11,12,13,14,15,16,17,18,19,20,21,22,23,24]
["Max Verstappen",{"$f":"20000000+SUM(C2:Z2)*100000","v":{"v":35300000,"d":"€ 35,300,000"}},9,9,-9,9,9,8,9,4,9,9,5,8,5,6,8,4,5,8,7,4,9,5,9,4,{"v":35300000,"d":"€ 35,300,000"},{"$f":"42/35.3","v":{"v":1.189801699716714,"d":"1.19"}},{"$f":"AA2*AB2","v":{"v":42000000.00000001,"d":"€ 42,000,000"}},{"$f":"AE2*1000000","v":{"v":42000000,"d":"€ 42,000,000"}},{"v":42,"d":"€ 42"}]
["Sergio Perez",{"v":20900000,"d":"€ 20,900,000"},8,8,5,8,7,6,2,-8,-8,2,3,-7,3,3,4,2,-7,0,3,-7,-1,0,-7,-10,{"v":20900000,"d":"€ 20,900,000"},{"$f":"42/35.3","v":{"v":1.189801699716714,"d":"1.19"}},{"$f":"AA3*AB3","v":{"v":24866855.524079323,"d":"€ 24,866,856"}},{"$f":"AE3*1000000","v":{"v":25000000,"d":"€ 25,000,000"}},{"v":25,"d":"€ 25"}]
["Lewis Hamilton",{"v":27300000,"d":"€ 27,300,000"},3,1,-8,1,1,4,4,3,6,7,6,9,7,9,2,5,1,4,-10,6,0,8,-2,6,{"v":27300000,"d":"€ 27,300,000"},{"v":1.189801699716714,"d":"1.19"},{"v":32481586.402266294,"d":"€ 32,481,586"},{"v":33000000,"d":"€ 33,000,000"},{"v":33,"d":"€ 33"}]
["George Russell",{"v":27800000,"d":"€ 27,800,000"},5,4,-7,3,4,2,3,5,7,6,9,-9,2,-10,3,3,7,6,4,5,6,9,6,5,{"v":27800000,"d":"€ 27,800,000"},{"v":1.189801699716714,"d":"1.19"},{"v":33076487.25212465,"d":"€ 33,076,487"},{"v":33000000,"d":"€ 33,000,000"},{"v":33,"d":"€ 33"}]
["Charles Leclerc",{"v":33100000,"d":"€ 33,100,000"},6,7,8,6,6,7,7,9,-9,5,-1,-4,6,7,7,9,8,5,9,7,5,6,8,7,{"v":33100000,"d":"€ 33,100,000"},{"v":1.189801699716714,"d":"1.19"},{"v":39382436.26062323,"d":"€ 39,382,436"},{"v":39000000,"d":"€ 39,000,000"},{"v":39,"d":"€ 39"}]
["Carlos Sainz Jr.",{"v":30200000,"d":"€ 30,200,000"},7,3,9,7,5,5,5,7,-6,4,7,5,4,4,5,6,-8,3,8,9,-6,7,4,8,{"v":30200000,"d":"€ 30,200,000"},{"v":1.189801699716714,"d":"1.19"},{"v":35932011.33144476,"d":"€ 35,932,011"},{"v":36000000,"d":"€ 36,000,000"},{"v":36,"d":"€ 36"}]
["Lando Norris",{"v":33700000,"d":"€ 33,700,000"},4,2,7,5,8,9,8,6,8,8,-10,7,8,5,9,7,6,9,6,8,4,4,0,9,{"v":33700000,"d":"€ 33,700,000"},{"v":1.189801699716714,"d":"1.19"},{"v":40096317.280453265,"d":"€ 40,096,317"},{"v":40000000,"d":"€ 40,000,000"},{"v":40,"d":"€ 40"}]
["Oscar Piastri",{"v":31700000,"d":"€ 31,700,000"},2,6,6,2,2,-3,6,8,5,3,8,6,9,8,6,8,9,7,5,2,2,3,7,0,{"v":31700000,"d":"€ 31,700,000"},{"v":1.189801699716714,"d":"1.19"},{"v":37716713.88101983,"d":"€ 37,716,714"},{"v":38000000,"d":"€ 38,000,000"},{"v":38,"d":"€ 38"}]
["Lance Stroll",{"v":11900000,"d":"€ 11,900,000"},0,-9,4,-2,-5,-7,1,-4,3,-4,-3,3,0,-1,-3,-9,-9,-4,-5,-1,-9,-5,-8,-4,{"v":11900000,"d":"€ 11,900,000"},{"v":1.189801699716714,"d":"1.19"},{"v":14158640.226628896,"d":"€ 14,158,640"},{"v":14000000,"d":"€ 14,000,000"},{"v":14,"d":"€ 14"}]
["Fernando Alonso",{"v":19600000,"d":"€ 19,600,000"},1,5,2,4,3,1,-9,-1,4,-2,-8,2,-1,2,0,-1,4,2,-3,-8,-4,-1,3,1,{"v":19600000,"d":"€ 19,600,000"},{"v":1.189801699716714,"d":"1.19"},{"v":23320113.314447593,"d":"€ 23,320,113"},{"v":23000000,"d":"€ 23,000,000"},{"v":23,"d":"€ 23"}]
["Esteban Ocon",{"v":11000000,"d":"€ 11,000,000"},-7,-3,-6,-5,-1,0,-4,-7,0,0,-2,-6,-8,1,-5,-4,-5,-3,-8,-3,8,-7,-10,-5,{"v":11000000,"d":"€ 11,000,000"},{"v":1.189801699716714,"d":"1.19"},{"v":13087818.696883854,"d":"€ 13,087,819"},{"v":13000000,"d":"€ 13,000,000"},{"v":13,"d":"€ 13"}]
["Pierre Gasly",{"v":13100000,"d":"€ 13,100,000"},-8,-10,-3,-6,-3,-2,-6,0,1,1,0,-10,-10,-3,1,-5,-2,-7,-2,0,7,-10,5,3,{"v":13100000,"d":"€ 13,100,000"},{"v":1.189801699716714,"d":"1.19"},{"v":15586402.266288953,"d":"€ 15,586,402"},{"v":16000000,"d":"€ 16,000,000"},{"v":16,"d":"€ 16"}]
["Alexander Albon",{"v":9100000,"d":"€ 9,100,000"},-5,-1,-1,-10,-2,-8,-10,1,-7,-8,-5,1,-4,-2,-4,1,3,-10,-6,-9,-8,-9,-5,-1,{"v":9100000,"d":"€ 9,100,000"},{"v":1.189801699716714,"d":"1.19"},{"v":10827195.467422098,"d":"€ 10,827,195"},{"v":11000000,"d":"€ 11,000,000"},{"v":11,"d":"€ 11"}]
["Logan Sargeant",{"v":5800000,"d":"€ 5,800,000"},-10,-4,-10,-7,-7,-10,-7,-5,-10,-10,-9,-1,-7,-7,-6,-2,2,-1,0,-2,-7,-4,-9,-9,{"v":5800000,"d":"€ 5,800,000"},{"v":1.189801699716714,"d":"1.19"},{"v":6900849.8583569415,"d":"€ 6,900,850"},{"v":7000000,"d":"€ 7,000,000"},{"v":7,"d":"€ 7"}]
["Daniel Ricciardo",{"v":11800000,"d":"€ 11,800,000"},-3,-6,-2,-9,-8,-5,-3,-2,2,-5,1,-3,-2,0,-2,-3,-3,-8,1,-6,1,-6,-4,-7,{"v":11800000,"d":"€ 11,800,000"},{"v":1.189801699716714,"d":"1.19"},{"v":14039660.056657225,"d":"€ 14,039,660"},{"v":14000000,"d":"€ 14,000,000"},{"v":14,"d":"€ 14"}]
["Yuki Tsunoda",{"v":12400000,"d":"€ 12,400,000"},-4,-5,3,0,-9,3,0,2,-4,-9,-4,0,1,-6,-7,-10,-10,-2,-4,-10,3,1,-3,-2,{"v":12400000,"d":"€ 12,400,000"},{"v":1.189801699716714,"d":"1.19"},{"v":14753541.076487254,"d":"€ 14,753,541"},{"v":15000000,"d":"€ 15,000,000"},{"v":15,"d":"€ 15"}]
["Valtteri Botas",{"v":6000000,"d":"€ 6,000,000"},-9,-7,-4,-4,-10,-6,-8,-3,-3,-6,-6,-5,-6,-5,-9,-6,-6,-6,-7,-4,-3,-8,-1,-8,{"v":6000000,"d":"€ 6,000,000"},{"v":1.189801699716714,"d":"1.19"},{"v":7138810.198300284,"d":"€ 7,138,810"},{"v":7000000,"d":"€ 7,000,000"},{"v":7,"d":"€ 7"}]
["Guanyu Zhou",{"v":6800000,"d":"€ 6,800,000"},-1,-8,-5,-8,-4,-4,-5,-6,-5,-3,-7,-8,-9,-9,-10,-8,-4,-5,-9,-5,-5,-3,2,-3,{"v":6800000,"d":"€ 6,800,000"},{"v":1.189801699716714,"d":"1.19"},{"v":8090651.558073656,"d":"€ 8,090,652"},{"v":8000000,"d":"€ 8,000,000"},{"v":8,"d":"€ 8"}]
["Nico Hülkenberg",{"v":16100000,"d":"€ 16,100,000"},-6,0,1,-1,0,-1,-1,-9,-1,-1,4,4,-3,-8,-1,-7,-1,1,2,1,-10,2,-6,2,{"v":16100000,"d":"€ 16,100,000"},{"v":1.189801699716714,"d":"1.19"},{"v":19155807.365439095,"d":"€ 19,155,807"},{"v":19000000,"d":"€ 19,000,000"},{"v":19,"d":"€ 19"}]
["Kevin Magnussen",{"v":12400000,"d":"€ 12,400,000"},-2,-2,0,-3,-6,-9,-2,-10,-2,-7,2,-2,-5,-4,-8,0,0,-9,-1,3,-2,-2,1,-6,{"v":12400000,"d":"€ 12,400,000"},{"v":1.189801699716714,"d":"1.19"},{"v":14753541.076487254,"d":"€ 14,753,541"},{"v":15000000,"d":"€ 15,000,000"},{"v":15,"d":"€ 15"}]
[null,null,{"$f":"SUM(C2:C21)","v":-10},{"$f":"SUM(D2:D21)","v":-10},-10,-10,-10,-10,-10,-10,-10,-10,-10,-10,-10,-10,-10,-10,-10,-10,-10,-10,-10,-10,-10,-10]
[]
["RED BULL _ Chassis",{"$f":"20000000+SUM(C24:Z24)*100000","v":{"v":36200000,"d":"€ 36,200,000"}},{"$f":"SUM(C2:C3)","v":17},{"$f":"SUM(D2:D3)","v":17},-4,17,16,14,11,-4,1,11,8,1,8,9,12,6,-2,8,10,-3,8,5,2,{"$f":"SUM(Z2:Z3)","v":-6},{"v":36200000,"d":"€ 36,200,000"},{"$f":"28/45.4","v":{"v":0.6167400881057269,"d":"0.62"}},{"$f":"AB24*AA24","v":{"v":22325991.189427312,"d":"€ 22,325,991"}},{"$f":"AE24*1000000","v":{"v":22000000,"d":"€ 22,000,000"}},22]
["MERCEDES _ Chassis",{"v":35100000,"d":"€ 35,100,000"},{"$f":"SUM(C4:C5)","v":8},{"$f":"SUM(D4:D5)","v":5},-15,4,5,6,7,8,13,13,15,0,9,-1,5,8,8,10,-6,11,6,17,4,{"$f":"SUM(Z4:Z5)","v":11},{"v":35100000,"d":"€ 35,100,000"},{"$f":"28/45.4","v":{"v":0.6167400881057269,"d":"0.62"}},{"$f":"AB25*AA25","v":{"v":21647577.092511013,"d":"€ 21,647,577"}},{"v":22000000,"d":"€ 22,000,000"},22]
["FERRARI _ Chassis",{"v":43300000,"d":"€ 43,300,000"},{"$f":"SUM(C6:C7)","v":13},{"$f":"SUM(D6:D7)","v":10},17,13,11,12,12,16,-15,9,6,1,10,11,12,15,0,8,17,16,-1,13,12,{"$f":"SUM(Z6:Z7)","v":15},{"v":43300000,"d":"€ 43,300,000"},{"v":0.6167400881057269,"d":"0.62"},{"v":26704845.814977974,"d":"€ 26,704,846"},{"v":27000000,"d":"€ 27,000,000"},27]
["MCLAREN _ Chassis",{"v":45400000,"d":"€ 45,400,000"},{"$f":"SUM(C8:C9)","v":6},{"$f":"SUM(D8:D9)","v":8},13,7,10,6,14,14,13,11,-2,13,17,13,15,15,15,16,11,10,6,7,7,{"$f":"SUM(Z8:Z9)","v":9},{"v":45400000,"d":"€ 45,400,000"},{"v":0.6167400881057269,"d":"0.62"},{"v":28000000,"d":"€ 28,000,000"},{"v":28000000,"d":"€ 28,000,000"},28]
["ASTON _ Chassis",{"v":11500000,"d":"€ 11,500,000"},{"$f":"SUM(C10:C11)","v":1},{"$f":"SUM(D10:D11)","v":-4},6,2,-2,-6,-8,-5,7,-6,-11,5,-1,1,-3,-10,-5,-2,-8,-9,-13,-6,-5,{"$f":"SUM(Z10:Z11)","v":-3},{"v":11500000,"d":"€ 11,500,000"},{"v":0.6167400881057269,"d":"0.62"},{"v":7092511.013215859,"d":"€ 7,092,511"},{"v":19000000,"d":"€ 19,000,000"},{"$f":"AE39+7","v":19}]
["ALPINE _ Chassis",{"v":4100000,"d":"€ 4,100,000"},{"$f":"SUM(C12:C13)","v":-15},{"$f":"SUM(D12:D13)","v":-13},-9,-11,-4,-2,-10,-7,1,1,-2,-16,-18,-2,-4,-9,-7,-10,-10,-3,15,-17,-5,{"$f":"SUM(Z12:Z13)","v":-2},{"v":4100000,"d":"€ 4,100,000"},{"v":0.6167400881057269,"d":"0.62"},{"v":2528634.3612334803,"d":"€ 2,528,634"},{"v":15000000,"d":"€ 15,000,000"},{"$f":"12+3","v":15}]
["WILLIAMS _ Chassis",{"v":-5100000,"d":"€ -5,100,000"},{"$f":"SUM(C14:C15)","v":-15},{"$f":"SUM(D14:D15)","v":-5},-11,-17,-9,-18,-17,-4,-17,-18,-14,0,-11,-9,-10,-1,5,-11,-6,-11,-15,-13,-14,{"$f":"SUM(Z14:Z15)","v":-10},{"v":-5100000,"d":"€ -5,100,000"},{"v":0.6167400881057269,"d":"0.62"},{"v":-3145374.4493392073,"d":"€ -3,145,374"},{"v":9000000,"d":"€ 9,000,000"},9]
["VISA CASH APP RB_ Chassis",{"v":4200000,"d":"€ 4,200,000"},{"$f":"SUM(C16:C17)","v":-7},{"$f":"SUM(D16:D17)","v":-11},1,-9,-17,-2,-3,0,-2,-14,-3,-3,-1,-6,-9,-13,-13,-10,-3,-16,4,-5,-7,{"$f":"SUM(Z16:Z17)","v":-9},{"v":4200000,"d":"€ 4,200,000"},{"v":0.6167400881057269,"d":"0.62"},{"v":2590308.370044053,"d":"€ 2,590,308"},{"v":15000000,"d":"€ 15,000,000"},{"$f":"12+3","v":15}]
["STAKE F1 TEAM_ Chassis",{"v":-7200000,"d":"€ -7,200,000"},{"$f":"SUM(C18:C19)","v":-10},{"$f":"SUM(D18:D19)","v":-15},-9,-12,-14,-10,-13,-9,-8,-9,-13,-13,-15,-14,-19,-14,-10,-11,-16,-9,-8,-11,1,{"$f":"SUM(Z18:Z19)","v":-11},{"v":-7200000,"d":"€ -7,200,000"},{"v":0.6167400881057269,"d":"0.62"},{"v":-4440528.634361234,"d":"€ -4,440,529"},{"v":8000000,"d":"€ 8,000,000"},8]
["HAAS _ Chassis",{"v":8500000,"d":"€ 8,500,000"},{"$f":"SUM(C20:C21)","v":-8},{"$f":"SUM(D20:D21)","v":-2},1,-4,-6,-10,-3,-19,-3,-8,6,2,-8,-12,-9,-7,-1,-8,1,4,-12,0,-5,{"$f":"SUM(Z20:Z21)","v":-4},{"v":8500000,"d":"€ 8,500,000"},{"v":0.6167400881057269,"d":"0.62"},{"v":5242290.748898678,"d":"€ 5,242,291"},{"v":17000000,"d":"€ 17,000,000"},{"$f":"12+5","v":17}]
[{"$nulls":27},"coureurs",null,"teams"]
[null,"10 is 0 , nummer 1 is 9 punten, nummer 20 = -10 punten",{"$nulls":24},"<15",0]
[{"$nulls":26},"15-20",{"v":1,"d":"€ 1"},null,{"v":7,"d":"€ 7"}]
[{"$nulls":26},"21-25",{"v":2,"d":"€ 2"}]
[{"$nulls":26},"25-34",{"$f":"3","v":{"v":3,"d":"€ 3"}}]
[{"$nulls":29},{"v":12000000,"d":"€ 12,000,000"},{"$f":"AD39/1000000","v":12}]
[]
[{"$nulls":26},"RED BULL _ Chassis","RB",null,{"v":28000000,"d":"€ 28,000,000"}]
[{"$nulls":26},"MERCEDES _ Chassis","MGP",null,{"v":25000000,"d":"€ 25,000,000"}]
[{"$nulls":26},"FERRARI _ Chassis","SF",null,{"v":25000000,"d":"€ 25,000,000"}]
[{"$nulls":26},"MCLAREN _ Chassis","McL",null,{"v":20000000,"d":"€ 20,000,000"}]
[{"$nulls":26},"ASTON _ Chassis","AsM",null,{"v":21000000,"d":"€ 21,000,000"}]
[{"$nulls":26},"ALPINE _ Chassis","ALP",null,{"v":15000000,"d":"€ 15,000,000"}]
[{"$nulls":26},"WILLIAMS _ Chassis","WIL",null,{"v":10000000,"d":"€ 10,000,000"}]
[{"$nulls":26},"VISA CASH APP RB_ Chassis","VCA",null,{"v":12000000,"d":"€ 12,000,000"}]
[{"$nulls":26},"STAKE F1 TEAM_ Chassis","SAU",null,{"v":10000000,"d":"€ 10,000,000"}]
[{"$nulls":26},"HAAS _ Chassis","HAA",null,{"v":8000000,"d":"€ 8,000,000"}]